{"text_format":"1","workbook":"xlsx","n_sheets":15,"sheets":["Cover","Instructions","Country data","TechScope Inputs","Score","Report","Country Conversion&Calculation","Currency dropdown","GHG Calculator Cover","User Manual","Input Sheet I","Input Sheet II","GHG Report","SWH Goal Module","Back End Data & Calcs"],"not_rendered":{"charts":10,"images":11,"macros":1,"external_links":0,"defined_names":39,"comments":7,"pivot_tables":0},"unopened":[],"bounds":{"document_bytes":16777216,"sheet_cells":100000,"rows_first":2000,"rows_last":500,"rows_between":2000,"halvings":0,"cell_chars":16384,"cell_head_chars":4096},"cells_cut":0,"cells_raw":0,"read":"whole","date_system":"1900"}

{"sheet":"Cover","index":0,"n_rows":12,"n_cols":5,"rows_kept":12,"cut":false,"hidden":false,"merged":[[4,2,4,7],[2,0,2,16383],[10,1,10,7],[5,1,5,7],[11,1,11,7]]}
[]
[]
[]
[]
[null,null,"TechScope"]
[null,"Solar Water Heating Market Readiness Analysis Tool"]
[null,null,null,null,"Version 2.0"]
[]
[]
[]
{"$rows_left_out":3}
{"sheet":"Instructions","index":1,"n_rows":27,"n_cols":4,"rows_kept":27,"cut":false,"hidden":false,"merged":[[26,1,26,5],[7,1,7,5],[0,0,0,5],[23,1,23,5],[5,1,5,5],[2,1,2,5],[14,1,14,5],[25,1,25,5],[15,1,15,5],[4,1,4,5]]}
["Instructions"]
[]
[null,"Overview"]
[]
[null,"This tool can be used to calculate the TechScope score for a given country. The tool should be used in conjunction with the guidance contained in the companion report: Solar Water Heating TechScope Market Readiness Assessment."]
[null,"The tool includes four sheets: two data input sheets (\"Country Data\" and \"TechScope Inputs\") and two output sheets (\"Score\" and \"Report\"). To calculate a TechScope score for a country, complete the data entry sheets as described below."]
[]
[null,"Entering data"]
[]
[null,"TechScope scores are based on 18 indicators spread across the following 4 parameters: "]
{"$rows_left_out":18}
{"sheet":"Country data","index":2,"n_rows":42,"n_cols":41,"rows_kept":42,"cut":false,"hidden":false,"merged":[[37,0,38,4],[1,8,1,9],[2,8,2,9],[36,1,36,2],[22,1,22,3],[32,0,32,4]]}
["COUNTRY DATA",null,null,null,null,null,null,"Legend"]
[null,null,null,null,null,null,null,"No input","Input field (optional)"]
["Country Name",null,null,null,null,null,null,"Calculated","Input field (mandatory)"]
[]
[]
[1,"Socio-economic data"]
[]
["1a","Data Description","Data Source","Unit",{"$f":"F8-1","v":2009},2010,2011,2012,{"$f":"J8-1","v":2013},{"$f":"YEAR(TODAY())-1","v":2014}]
[null,"Population","World Bank","#"]
[null,"GDP","World Bank"]
{"$rows_left_out":33}
{"sheet":"TechScope Inputs","index":3,"n_rows":134,"n_cols":42,"rows_kept":134,"cut":false,"hidden":false,"merged":[[1,10,2,10],[54,3,56,3],[52,3,53,3],[65,7,65,9],[122,2,122,6],[12,2,12,6],[20,2,20,6],[16,2,16,6],[24,2,24,6],[45,8,45,10]]}
["SOLAR HOT WATER MARKET DATA",null,null,null,null,null,null,null,"Legend"]
[null,null,null,null,null,null,null,null,"No input","Input field (optional)","Reference to section of companion report","These columns will be hidden ----->"]
["Country Name",null,null,{"$f":"'Country data'!C3","v":0},null,null,null,null,"Calculated","Input field (mandatory)"]
[]
[1,null,"Parameter I: Solar Water Heating Support Framework"]
[]
["1a",null,"SWH Targets"]
[]
[null,null,"Has the country established a solar thermal target?"]
[]
{"$rows_left_out":125}
{"sheet":"Score","index":4,"n_rows":23,"n_cols":7,"rows_kept":23,"cut":false,"hidden":false,"merged":[[15,1,19,1],[15,2,19,2],[2,1,6,1],[2,2,6,2],[7,1,12,1],[7,2,12,2],[13,1,14,1],[13,2,14,2]]}
[]
[null,"Parameter","Parameter Weight  ","Indicator Weight ","Indicator","Raw Score","Weighted Score"]
[null,"I. Solar Water Heating Support Framework",0.28999999999999998,0.05,"SWH Targets",{"$f":"IF('TechScope Inputs'!H9=\"Yes\",5,0)","v":0},{"$f":"F3*D3","v":0}]
[null,null,null,0.08,"Financial Incentives for System Installation",{"$f":"IF('TechScope Inputs'!H13=\"Yes\",5,0)","v":0},0]
[null,null,null,7.0000000000000007E-2,"SWH Loan Programs",{"$f":"IF('TechScope Inputs'!H17=\"Yes\",5,0)","v":0},0]
[null,null,null,0.05,"Building Mandates",{"$f":"IF('TechScope Inputs'!H21=\"National\",5,IF('TechScope Inputs'!H21=\"Subnational\",2.5,0))","v":0},0]
[null,null,null,0.04,"Outreach Campaigns",{"$f":"IF('TechScope Inputs'!H25=\"Yes\",5,0)","v":0},0]
[null,"II. National Conditions",0.3,0.05,"Insolation",{"$f":"('TechScope Inputs'!G33/9)*5","v":{"$error":"#N/A"}},{"$error":"#N/A"}]
[null,null,null,0.04,"SWH Market Penetration",{"$f":"'TechScope Inputs'!F38/268.2*5","v":0},0]
[null,null,null,0.05,"Residential Energy Consumption Growth ",{"$f":"MIN(5,'TechScope Inputs'!F43/0.025*5)","v":{"$error":"#DIV/0!"}},{"$error":"#DIV/0!"}]
{"$rows_left_out":14}
{"sheet":"Report","index":5,"n_rows":185,"n_cols":14,"rows_kept":185,"cut":false,"hidden":false,"merged":[[144,11,144,12],[145,11,145,12],[146,11,146,12],[184,6,184,7],[184,12,184,13],[162,4,162,5],[163,4,163,5],[156,2,157,3],[158,2,162,3],[163,1,163,3],[157,4,157,5],[158,4,158,5],[159,4,159,5],[160,4,160,5],[161,4,161,5],[163,11,163,12],[156,6,156,10],[157,6,157,10],[158,6,158,10],[159,6,159,10],[160,6,160,10],[161,6,161,10],[162,6,162,10],[163,6,163,10],[144,6,144,10],[145,6,145,10],[146,6,146,10],[147,6,147,10],[148,6,148,10],[149,6,149,10],[150,6,150,10],[151,6,151,10],[152,6,152,10],[161,11,161,12],[162,11,162,12],[153,11,153,12],[154,11,154,12],[155,11,155,12],[156,11,156,12],[157,11,157,12],[156,4,156,5],[153,6,153,10],[154,6,154,10],[155,6,155,10],[155,4,155,5],[158,11,158,12],[159,11,159,12],[160,11,160,12],[147,11,147,12],[148,11,148,12],[149,11,149,12],[150,11,150,12],[151,11,151,12],[152,11,152,12],[144,4,144,5],[158,1,162,1],[144,2,144,3],[145,1,149,1],[150,1,155,1],[156,1,157,1],[150,2,155,3],[153,4,153,5],[154,4,154,5],[151,4,151,5],[152,4,152,5],[149,4,149,5],[150,4,150,5],[145,4,145,5],[145,2,149,3],[146,4,146,5],[147,4,147,5],[148,4,148,5],[42,3,42,9],[41,3,41,9],[79,5,79,8],[79,9,79,11],[79,2,79,4],[86,2,86,3],[86,4,86,5],[86,6,86,7],[86,8,86,9],[86,10,86,11],[1,10,1,13],[78,2,78,4],[78,5,78,8],[78,9,78,11],[56,1,56,13],[51,6,51,7],[3,1,3,13],[51,12,51,13],[83,3,83,4],[83,5,83,6],[83,7,83,8],[83,9,83,10],[82,3,82,4],[82,5,82,6],[82,7,82,8],[82,9,82,10],[44,3,44,9],[45,3,45,9],[41,11,41,12],[42,11,42,12],[43,11,43,12],[44,11,44,12],[45,11,45,12],[43,3,43,9],[91,12,91,13],[96,1,96,13],[94,10,94,13],[87,2,87,3],[87,4,87,5],[87,6,87,7],[87,8,87,9],[87,10,87,11],[111,8,111,11],[91,6,91,7],[107,8,107,10],[177,1,177,13],[178,1,178,13],[179,1,179,13],[180,1,180,13],[167,1,167,13],[101,13,103,13],[101,12,103,12],[107,12,109,12],[107,13,109,13],[122,2,122,3],[122,4,122,5],[122,6,122,7],[122,8,122,9],[122,10,122,11],[126,13,130,13],[136,6,136,7],[136,12,136,13],[139,10,139,13],[141,1,141,13],[123,2,123,3],[123,4,123,5],[123,6,123,7],[123,8,123,9],[123,10,123,11]]}
[null,"Techscope Report",null,null,null,null,null,null,null,null,"Country:"]
[null,"Solar Thermal Market Analysis",null,null,null,null,null,null,null,null,{"$f":"'Country data'!C3","v":0}]
[]
[null,"COUNTRY TRENDS"]
[]
[null,"POPULATION",null,null,null,null,null,"GDP"]
[]
[]
[]
[]
{"$rows_left_out":176}
{"sheet":"Country Conversion&Calculation","index":6,"n_rows":277,"n_cols":20,"rows_kept":277,"cut":false,"hidden":true,"merged":[[87,2,87,8],[68,1,68,5],[1,1,1,6],[29,2,29,7],[34,2,34,7],[44,1,44,6],[267,1,267,5],[96,0,97,0],[96,1,97,1],[96,2,97,2],[96,4,97,5],[96,3,97,3]]}
["LEBANON"]
["SWH Market"]
["Growth Rate","-% to 0%","1% to 5%","6% to 10%","11% to 15%","16% to 20%","20% or greater"]
["Score",0,1,2,3,4,5]
[]
[]
["SWH Market"]
["Growth Rate","Score"]
["-% to 0%",0]
["1% to 5%",1]
{"$rows_left_out":268}
{"sheet":"Currency dropdown","index":7,"n_rows":4,"n_cols":8,"rows_kept":4,"cut":false,"hidden":true,"merged":[]}
[null,"Please select currency",null,null,"Please select currency",null,null,"Please select tax option"]
[null,"Cost in €",null,null,"in €",null,null,"VAT inc."]
[null,"Cost in $",null,null,"in $",null,null,"VAT exc."]
[null,"Cost in local currency",null,null,"in local currency"]

{"sheet":"GHG Calculator Cover","index":8,"n_rows":15,"n_cols":6,"rows_kept":15,"cut":false,"hidden":false,"merged":[[14,5,14,7],[12,5,12,7],[11,1,11,7],[2,0,2,16383],[4,2,4,7],[5,1,5,7],[9,1,9,7],[10,1,10,7]]}
[]
[]
[]
[]
[null,null,"TechScope"]
[null,"Greenhouse Gas Calculator for \nResidential Solar Water Heating"]
[null,null,null,null,"Version 1.0"]
[]
[]
[null,"The Greenhouse Gas Calculator for Residential Solar Water Heating (\"GHG Calculator\") is an optional module integrated into the TechScope Tool. It is not necessary to complete in order to generate a TechScope score for a country; however, the GHG Calculator provides complementary functions designed to help policymakers quantify the GHG emissions reductions associated with increased development of Solar Water Heating (SWH) systems. The GHG Calculator can also be used to establish SWH targets designed to achieve specific GHG emissions reductions."]
{"$rows_left_out":6}
{"sheet":"User Manual","index":9,"n_rows":81,"n_cols":5,"rows_kept":81,"cut":false,"hidden":false,"merged":[[1,0,1,5],[3,4,3,6],[63,1,63,5],[77,1,77,5],[65,1,65,5],[67,1,67,5],[72,1,72,5],[73,1,73,5],[74,1,74,5],[71,1,71,5],[75,1,75,5],[47,1,47,5],[49,1,49,5],[51,1,51,5],[53,1,53,5],[58,1,58,5],[59,1,59,5],[61,1,61,5],[55,1,55,5],[48,1,48,5],[50,1,50,5],[52,1,52,5],[56,1,56,5],[57,1,57,5],[54,1,54,5],[60,1,60,5],[41,1,41,5],[43,1,43,5],[44,1,44,5],[46,1,46,5],[40,1,40,5],[45,1,45,5],[38,1,38,5],[21,1,21,5],[0,0,0,5],[5,1,5,5],[7,1,7,5],[9,1,9,5],[24,1,24,5],[19,1,19,5],[23,1,23,5],[8,1,8,5],[17,1,17,5],[12,1,12,5],[36,1,36,5],[33,1,33,5],[16,1,16,5],[34,1,34,5],[82,1,82,6],[69,1,69,5],[68,1,68,5],[70,1,70,5],[79,1,79,5],[80,1,80,5]]}
["Greenhouse Gas Calculator for Residential Solar Water Heating"]
["Integrated User Manual"]
[]
[null,null,null,null,"PROCEED TO TOOL u"]
[]
[1,"Introduction"]
[]
[null,"The Greenhouse Gas (GHG) Calculator is an optional module integrated into the TechScope Tool. It is not necessary to complete in order to generate a TechScope score for a country; however, the GHG Calculator provides complementary functions designed to help policymakers quantify the GHG emissions reductions associated with increased development of Solar Water Heating (SWH) systems. As discussed below, the GHG Calculator can also be used to establish SWH targets in order to achieve desired GHG emissions reductions."]
[2,"Intended Uses"]
[null,"The tool is designed for simplicity, flexibility, and scalability. It estimates the emissions avoided by installing SWH systems using a few simple inputs and assumptions on the type and quantity of installed SWH system (under \"Input Sheet I\") and the type and ratio of fossil fuel-driven hot water heating systems that are replaced or whose use is reduced by the SWH systems (\"Input Sheet II\"). As such, it is possible to use the GHG Calculator for a variety of purposes, including:"]
{"$rows_left_out":72}
{"sheet":"Input Sheet I","index":10,"n_rows":75,"n_cols":75,"rows_kept":75,"cut":false,"hidden":false,"merged":[[74,9,74,10],[5,2,5,3],[27,2,27,10],[44,2,44,10],[52,2,52,10],[62,2,62,10],[34,2,34,3],[30,2,30,3],[29,2,29,3],[35,2,35,3],[20,2,21,2],[10,8,10,9],[11,8,11,9],[8,2,8,10],[13,2,13,10],[18,2,18,10],[11,2,11,3],[10,2,10,3],[10,5,10,6],[11,5,11,6],[3,3,3,7]]}
[{"$f":"'User Manual'!A1:F1","v":"Greenhouse Gas Calculator for Residential Solar Water Heating"},null,null,null,null,null,null,null,null,"Legend"]
["Input Sheet I: Calculating the Output of SWH Systems",null,null,null,null,null,null,null,null,"Context Help","Input field (optional)"]
[null,null,null,null,null,null,null,null,null,"Calculated","Input field (mandatory)"]
["Enter Country Name:",null,null,null,null,null,null,null,null,"Data Label","Intermediate or final result"]
[]
[null,null,"t RETURN TO USER MANUAL"]
[]
[]
[1,"?","Preferred Units of Measurement"]
[]
{"$rows_left_out":66}
{"sheet":"Input Sheet II","index":11,"n_rows":69,"n_cols":172,"rows_kept":69,"cut":false,"hidden":false,"merged":[[66,7,66,10],[68,7,68,10],[53,2,53,9],[29,2,29,9],[19,2,19,9],[8,2,8,9],[42,2,42,3],[43,2,43,3],[40,2,40,9],[3,3,3,7],[5,2,5,3]]}
[{"$f":"'User Manual'!A1:F1","v":"Greenhouse Gas Calculator for Residential Solar Water Heating"},null,null,null,null,null,null,null,"Legend"]
["Input Sheet I: Calculating the Output of SWH Systems",null,null,null,null,null,null,null,"Context Help","Input field (optional)"]
[null,null,null,null,null,null,null,null,"Calculated","Input field (mandatory)"]
["Country/Region Name:",null,null,{"$f":"'Country data'!C3","v":0},null,null,null,null,"Data Label","Intermediate or final result"]
[]
[null,null,"t RETURN TO INPUT SHEET I"]
[]
[]
[8,"?","Type of Fossil Fuel Used that is Avoided by SWH Systems"]
[]
{"$rows_left_out":60}
{"sheet":"GHG Report","index":12,"n_rows":36,"n_cols":14,"rows_kept":36,"cut":false,"hidden":false,"merged":[[8,5,8,6],[9,5,9,6],[10,5,10,6],[20,5,20,6],[3,1,3,6],[5,1,5,3],[5,5,5,6],[6,5,6,6],[7,5,7,6],[25,1,25,2],[16,5,16,6],[19,5,19,6],[15,1,16,2],[11,5,11,6],[23,1,23,6],[13,1,13,6],[17,1,17,2],[17,5,17,6]]}
[null,"TechScope Report",null,null,null,null,"Country:"]
[null,{"$f":"'Input Sheet I'!A1","v":"Greenhouse Gas Calculator for Residential Solar Water Heating"},null,null,null,null,{"$f":"'Input Sheet I'!D4","v":0}]
[]
[null,"OUTPUT OF SOLAR WATER HEATING SYSTEMS INSTALLED"]
[]
[null,{"$f":"\"Solar Hot Water Systems Installed (\"&'Input Sheet I'!D56&\")\"","v":"Solar Hot Water Systems Installed (m2)"},null,null,null,{"$f":"\"Energy Output (\"&'Input Sheet I'!D66&\")\"","v":"Energy Output (kWhth/yr)"}]
[null,null,"TOTAL",{"$f":"'Input Sheet I'!D61","v":0},null,{"$f":"'Input Sheet I'!D71","v":0}]
[null,null,{"$f":"'Input Sheet I'!C57","v":0},{"$f":"'Input Sheet I'!D57","v":0},null,{"$f":"'Input Sheet I'!D67","v":0}]
[null,null,{"$f":"'Input Sheet I'!C58","v":0},{"$f":"'Input Sheet I'!D58","v":0},null,{"$f":"'Input Sheet I'!D68","v":0}]
[null,null,{"$f":"'Input Sheet I'!C59","v":0},{"$f":"'Input Sheet I'!D59","v":0},null,{"$f":"'Input Sheet I'!D69","v":0}]
{"$rows_left_out":27}
{"sheet":"SWH Goal Module","index":13,"n_rows":51,"n_cols":10,"rows_kept":51,"cut":false,"hidden":false,"merged":[[50,6,50,7],[0,0,0,5],[3,3,3,4],[0,6,0,7],[5,2,5,3],[7,2,7,3],[17,2,18,2],[17,3,18,3],[10,2,10,7],[15,2,15,7],[25,2,25,7],[30,2,30,7],[27,2,27,3],[28,2,28,3],[38,2,38,7],[36,2,36,6]]}
["Greenhouse Gas Calculator for Residential Solar Water Heating",null,null,null,null,null,"Legend"]
["Setting a SWH Target to Achieve GHG Emissions Reduction Goals",null,null,null,null,null,"Context Help","Input field (optional)"]
[null,null,null,null,null,null,"Calculated","Input field (mandatory)"]
["Country/Region Name:",null,null,{"$f":"'Country data'!C3","v":0},null,null,"Data Label","Intermediate or final result"]
[]
[null,null,"t RETURN TO INPUT SHEET I"]
[]
[null,null,"t RETURN TO INPUT SHEET II"]
[]
[]
{"$rows_left_out":42}
{"sheet":"Back End Data & Calcs","index":14,"n_rows":154,"n_cols":52,"rows_kept":154,"cut":false,"hidden":true,"merged":[[2,12,2,19]]}
[null,"Module Efficiency for OECD Countires",null,null,null,null,null,null,null,null,null,null,"GHG Emissions Factors for Stationary Combustion Fuels",null,null,null,null,null,null,null,null,null,null,null,null,null,null,"Country Generation Mixes",null,null,null,null,null,null,null,null,null,null,null,null,null,"GHG Emissions from Electricty per kWh",null,null,null,null,null,null,"Unit Conversions"]
[null,"Source: IEA-SHC (2013). Solar Heating Worldwide 2015 Edition.",null,null,null,null,null,null,null,null,null,null,"Source: IPCC (2006). Guidelines for National Greenhouse Gas Inventories. Chapter 2: Stationary Combustion",null,null,null,null,null,null,null,"Alternate Source (US-focused):",null,null,null,null,null,null,"Source: CO2 Emissions from Fuel Combustion (2014 Edition), IEA, Paris.",null,null,null,null,null,null,null,null,null,null,null,null,null,"Source: CO2 Emissions From Fuel Combustion Highlights 2011"]
[null,"http://www.iea-shc.org/data/sites/1/publications/Solar-Heat-Worldwide-2015.pdf ",null,null,null,null,null,null,null,null,null,null," TABLE 2.5: DEFAULT EMISSION FACTORS FOR STATIONARY COMBUSTION IN THE RESIDENTIAL AND AGRICULTURE/FORESTRY/FISHING/FISHING FARMS CATEGORIES ",null,null,null,null,null,null,null,"EIA Carbon Dioxide Emissions Coefficients",null,null,null,null,null,null,null,"COAL",null,null,"OIL",null,null,"GAS",null,null,"TOTAL",null,null,null,"grammes CO 2 / kilowatt hour"]
[null,null,null,null,null,null,null,null,null,null,null,null,"Global Warming Potentials (GWP) for CH4 and N20 from 2013 IPCC AR5 (100 year)",null,null,null,null,null,null,null,"http://www.eia.gov/environment/emissions/co2_vol_mass.cfm",null,null,null,null,null,null,null,2010,2011,2012,2010,2011,2012,2010,2011,2012,2010,2011,2012]
[null,"Country","Total\ncollector area\n[m²]","Total\ncapacity\n[MWth]","Calculated\nnumber\nof systems","Collector yield [GWh/a]","Energy\nsavings\n[toe/a]","CO2\nreduction\n[tCO2/a]","Yield per m2 [kWh/a/m2]","Insolation [kWh/m2/year]","Efficiency of Selected Country",null,"kg / TJ","CO2","CH4","N2O","CO2e","CO2e (kg/MMBtu)",null,null,null,"lbs CO2","Kg CO2","Lbs CO2 per MMBTU","Kg CO2 per MMBtu",null,null,"million tonnes of CO2",null,null,null,null,null,null,null,null,null,null,null,null,null,"Country/Region",2009]
[null,"Albania",141885,99,18188,99,10664,34473,{"$f":"F6*1000000/C6","v":697.74817633999362},{"$f":"IF($B6='Input Sheet I'!$C$36,'Input Sheet I'!$F$17,\"\")","v":""},{"$f":"IF($B6='Input Sheet I'!$C$36,I6/J6,\"\")","v":""},null,"GWP",null,34,298,null,null,null,null,null,null,null,null,null,null,null,"World",13136.30089,13751.78369,13923.758309999999,10990.400540000001,11103.029920000001,11205.38622,6214.8299610000004,6327.2531440000002,6439.7777980000001,{"$f":"AI6+AF6+AC6","v":30341.531391000004},{"$f":"AJ6+AG6+AD6","v":31182.066754000003},31568.922328000001,null,"Africa",643]
[null,"Australia",8023000,5616,1024556,4992,536591,1734637,{"$f":"F7*1000000/C7","v":622.21114296397855},{"$f":"IF($B7='Input Sheet I'!$C$36,'Input Sheet I'!$F$17,\"\")","v":""},{"$f":"IF($B7='Input Sheet I'!$C$36,I7/J7,\"\")","v":""},null,null,null,null,null,null,null,null,null,"For homes and businesses",null,null,null,null,"Compare to IPCC",null,"Albania",0.44742599999999999,0.560477,0.65482399999999996,3.4252220000000002,3.544457,3.1407880000000001,2.6869000000000001E-2,2.8024E-2,3.0886E-2,{"$f":"AI7+AF7+AC7","v":3.8995170000000003},{"$f":"AJ7+AG7+AD7","v":4.1329579999999995},{"$f":"AK7+AH7+AE7","v":3.8264980000000004},null,"Albania",11]
[null,"Austria",5056098,3539,503348,2044,219716,710276,404.26431607931647,{"$f":"IF($B8='Input Sheet I'!$C$36,'Input Sheet I'!$F$17,\"\")","v":""},{"$f":"IF($B8='Input Sheet I'!$C$36,I8/J8,\"\")","v":""},null,"Crude Oil",73300,10,0.6,{"$f":"N8+O$6*O8+P$6*P8","v":73818.8},null,null,null,"Propane","12.7/gallon","5.8/gallon",139,63.1,null,null,"Algeria",0.73182999999999998,0.58884800000000004,0.58398700000000003,43.748567999999999,46.821243000000003,50.903882000000003,53.034022999999998,56.472509000000002,62.859591000000002,97.514420999999999,103.88260000000001,114.34746,null,"Algeria",576]
[null,"Barbados",131690,92,26977,112,12024,38869,850.48219302908342,{"$f":"IF($B9='Input Sheet I'!$C$36,'Input Sheet I'!$F$17,\"\")","v":""},{"$f":"IF($B9='Input Sheet I'!$C$36,I9/J9,\"\")","v":""},null,"Natural Gas Liquids",64200,10,0.6,64718.8,{"$f":"Q9*0.00105505585","v":68.281948544979997},null,null,"Butane","14.8/gallon","6.7/gallon",143.19999999999999,65,null,null,"Angola",0,0,0,14.310244000000001,14.294214,15.005476,1.398917,1.4351780000000001,1.4504459999999999,15.709161000000002,15.729392000000001,16.455922000000001,null,"Angola",237]
[null,"Belgium",487783,341,99922,199,21379,69112,407.96829737813744,{"$f":"IF($B10='Input Sheet I'!$C$36,'Input Sheet I'!$F$17,\"\")","v":""},{"$f":"IF($B10='Input Sheet I'!$C$36,I10/J10,\"\")","v":""},null,"Motor Gasoline",69300,10,0.6,69818.8,73.662733379979997,null,null,"Butane/Propane Mix","13.7/gallon","6.2/gallon",141.1,64,null,null,"Argentina",5.6286759999999996,6.4096549999999999,5.4811649999999998,81.348856999999995,84.278188999999998,87.251237000000003,89.354636999999997,93.016969000000003,95.776381999999998,176.33216999999999,183.704813,188.50878400000002,null,"Argentina",393]
{"$rows_left_out":144}